{"text_format":"1","workbook":"xlsx","n_sheets":6,"sheets":["E OKUL YAPIŞTIR","ÇIKTI (3 DEĞERLENDİRME)","PUAN DAĞILIMI","ÇIKTI (2 DEĞERLENDİRME)","ÇIKTI (PROJE)","SABİTLER"],"not_rendered":{"charts":0,"images":2,"macros":1,"external_links":1,"defined_names":18,"comments":0,"pivot_tables":0},"unopened":[],"bounds":{"document_bytes":16777216,"sheet_cells":100000,"rows_first":2000,"rows_last":500,"rows_between":2000,"halvings":0,"cell_chars":16384,"cell_head_chars":4096},"cells_cut":0,"cells_raw":0,"read":"whole","date_system":"1900"}

{"sheet":"E OKUL YAPIŞTIR","index":0,"n_rows":40,"n_cols":30,"rows_kept":40,"cut":false,"hidden":false,"merged":[[0,15,0,16],[0,23,0,25],[0,27,0,29],[3,15,24,20]]}
[1,null,null,null,null,null,null,null,null,null,null,null,null,null,null,"SINIF:",null,"5/A",null,null,null,null,null,"Proje Alan Öğenciler",null,null,null,"Proje Alan Öğenciler"]
[2,null,null,null,null,null,null,null,null,null,null,null,null,null,null,null,null,null,null,null,null,null,null,"Öğr no","Adı Soyadı","Proje Notu",null,"Öğr no","Adı Soyadı","Proje Notu"]
[3,null,null,null,null,null,null,null,null,null,null,null,null,null,null,null,null,null,null,null,null,null,1,{"$f":"IFERROR(VLOOKUP($W3,$AA$3:$AD$380,2,0),\"\")","v":""},{"$f":"IFERROR(VLOOKUP($W3,$AA$3:$AD$380,3,0),\"\")","v":""},{"$f":"IFERROR(VLOOKUP($W3,$AA$3:$AD$380,4,0),\"\")","v":""},{"$f":"IF(AD3=\"\",\"\",COUNTIF($AD$3:AD3,\">=0\"))","v":""},{"$f":"IF(AD3=\"\",\"\",B1)","v":""},{"$f":"IF(AD3=\"\",\"\",C1)","v":""},{"$f":"IF(F1=\"G\",0,IF(F1=0,\"\",F1))","v":""}]
[4,null,null,null,null,null,null,null,null,null,null,null,null,null,null,"LÜTFEN E OKULDAN VERİ ALIRKEN EN BAŞTAKİ ÖĞRENCİ NUMARASINDAN BAŞLAYIP EN SON ORTALAMAYA KADAR ALINIZ. \nSONRA BU SAYFADAKİ YAPIŞTIR BUTONUNA BASINIZ\n\nARDINDAN SINIFI DEĞİŞTİRMEYİ UNUTMAYINIZ.\n\n\n\nBilgi ve sorun için;\nHüseyin UĞUR\nmatog64@hotmail.com",null,null,null,null,null,null,{"$f":"W3+1","v":2},{"$f":"IFERROR(VLOOKUP($W4,$AA$3:$AD$380,2,0),\"\")","v":""},{"$f":"IFERROR(VLOOKUP($W4,$AA$3:$AD$380,3,0),\"\")","v":""},{"$f":"IFERROR(VLOOKUP($W4,$AA$3:$AD$380,4,0),\"\")","v":""},{"$f":"IF(AD4=\"\",\"\",COUNTIF($AD$3:AD4,\">=0\"))","v":""},{"$f":"IF(AD4=\"\",\"\",B2)","v":""},{"$f":"IF(AD4=\"\",\"\",C2)","v":""},{"$f":"IF(F2=\"G\",0,IF(F2=0,\"\",F2))","v":""}]
[5,null,null,null,null,null,null,null,null,null,null,null,null,null,null,null,null,null,null,null,null,null,{"$f":"W4+1","v":3},"","","",{"$f":"IF(AD5=\"\",\"\",COUNTIF($AD$3:AD5,\">=0\"))","v":""},"","",""]
[6,null,null,null,null,null,null,null,null,null,null,null,null,null,null,null,null,null,null,null,null,null,4,"","","",{"$f":"IF(AD6=\"\",\"\",COUNTIF($AD$3:AD6,\">=0\"))","v":""},"","",""]
{"$rows_left_out":35}
{"sheet":"ÇIKTI (3 DEĞERLENDİRME)","index":1,"n_rows":40,"n_cols":80,"rows_kept":40,"cut":false,"hidden":false,"merged":[[2,12,2,14],[2,15,2,17],[2,18,2,20],[2,21,2,23],[2,24,2,26],[39,19,39,23],[38,3,38,12],[39,3,39,12],[39,25,39,29],[0,0,0,35],[1,0,1,35],[38,25,38,29],[38,19,38,23],[2,0,2,2],[3,0,3,2],[2,3,2,5],[2,6,2,8],[2,9,2,11],[2,27,2,29],[2,30,2,32],[2,33,2,35]]}
[{"$f":"CONCATENATE(SABİTLER!B2,\" \",SABİTLER!B8,\" EĞİTİM ÖĞRETİM YILI \")","v":"MUSTAFAKEMALPAŞA ORTAOKULU 2018-2019 EĞİTİM ÖĞRETİM YILI "},null,null,null,null,null,null,null,null,null,null,null,null,null,null,null,null,null,null,null,null,null,null,null,null,null,null,null,null,null,null,null,null,null,null,null,null,null,null,null,null,null,null,null,null,null,null,null,null,null,4,{"$f":"AY1","v":4},{"$f":"AZ1","v":4},{"$f":"AY1+1","v":5},{"$f":"BB1","v":5},{"$f":"BC1","v":5},{"$f":"BB1+1","v":6},{"$f":"BE1","v":6},6,{"$f":"BE1+1","v":7},{"$f":"BH1","v":7},7,{"$f":"BH1+1","v":8},{"$f":"BI1+1","v":8},{"$f":"BL1","v":8},{"$f":"BK1+1","v":9},{"$f":"BN1","v":9},{"$f":"BO1","v":9},{"$f":"BN1+1","v":10},{"$f":"BQ1","v":10},{"$f":"BR1","v":10},{"$f":"BQ1+1","v":11},{"$f":"BT1","v":11},11,{"$f":"BT1+1","v":12},{"$f":"BW1","v":12},12,{"$f":"BW1+1","v":13},{"$f":"BX1+1","v":13},{"$f":"CA1","v":13}]
[{"$f":"CONCATENATE('E OKUL YAPIŞTIR'!R1,\" SINIFI \",SABİTLER!B3,\" DERSİ \",SABİTLER!B9,\" DERS İÇİ PERFORMANS DEĞERLENDİRME FORMU\")","v":"5/A SINIFI FEN BİLİMLERİ DERSİ 2. DÖNEM DERS İÇİ PERFORMANS DEĞERLENDİRME FORMU"}]
["Öğrenci Bilgileri;",null,null,{"$f":"VLOOKUP(1,SABİTLER!$E$2:$F$331,2,0)","v":"Grup çalışmalarına katılımı"},null,null,{"$f":"VLOOKUP(2,SABİTLER!$E$2:$F$331,2,0)","v":"Sınıf içi tartışmalara katılımı"},null,null,{"$f":"VLOOKUP(3,SABİTLER!$E$2:$F$331,2,0)","v":"Soru ve önerilere verdiği cevap"},null,null,{"$f":"VLOOKUP(4,SABİTLER!$E$2:$F$331,2,0)","v":"Sınıf etkinliklerine katılımı"},null,null,{"$f":"VLOOKUP(5,SABİTLER!$E$2:$F$331,2,0)","v":"Derse istekli olma"},null,null,{"$f":"VLOOKUP(6,SABİTLER!$E$2:$F$331,2,0)","v":"Verilen ödevleri zamanında yapma"},null,null,{"$f":"VLOOKUP(7,SABİTLER!$E$2:$F$331,2,0)","v":"Sınıf içi çalışmalarında dönüt alınabilmesi"},null,null,{"$f":"VLOOKUP(8,SABİTLER!$E$2:$F$331,2,0)","v":"Derslere hazır gelmesi"},null,null,{"$f":"VLOOKUP(9,SABİTLER!$E$2:$F$331,2,0)","v":"Derste yapılan deneylere etkili katılım"},null,null,{"$f":"VLOOKUP(10,SABİTLER!$E$2:$F$331,2,0)","v":"Sınıfın düzenini bozmaması"},null,null,{"$f":"VLOOKUP(11,SABİTLER!$E$2:$F$331,2,0)","v":"TOPLAM PUAN"},null,null,"1. PUANLAR","2. PUANLAR","3. PUANLAR","1. PUAN SIRALAMA","2. PUAN SIRALAMA","3. PUAN SIRALAMA",{"$f":"AN3","v":"1. PUAN SIRALAMA"},{"$f":"AO3","v":"2. PUAN SIRALAMA"},{"$f":"AP3","v":"3. PUAN SIRALAMA"},{"$f":"AQ3","v":"1. PUAN SIRALAMA"},{"$f":"AR3","v":"2. PUAN SIRALAMA"},{"$f":"AS3","v":"3. PUAN SIRALAMA"},{"$f":"AT3","v":"1. PUAN SIRALAMA"},{"$f":"AU3","v":"2. PUAN SIRALAMA"},{"$f":"AV3","v":"3. PUAN SIRALAMA"},{"$f":"AW3","v":"1. PUAN SIRALAMA"},{"$f":"AX3","v":"2. PUAN SIRALAMA"},{"$f":"AY3","v":"3. PUAN SIRALAMA"},{"$f":"AZ3","v":"1. PUAN SIRALAMA"},{"$f":"BA3","v":"2. PUAN SIRALAMA"},{"$f":"BB3","v":"3. PUAN SIRALAMA"},{"$f":"BC3","v":"1. PUAN SIRALAMA"},{"$f":"BD3","v":"2. PUAN SIRALAMA"},{"$f":"BE3","v":"3. PUAN SIRALAMA"},{"$f":"BF3","v":"1. PUAN SIRALAMA"},{"$f":"BG3","v":"2. PUAN SIRALAMA"},{"$f":"BH3","v":"3. PUAN SIRALAMA"},{"$f":"BI3","v":"1. PUAN SIRALAMA"},{"$f":"BJ3","v":"2. PUAN SIRALAMA"},{"$f":"BK3","v":"3. PUAN SIRALAMA"},{"$f":"BL3","v":"1. PUAN SIRALAMA"},{"$f":"BM3","v":"2. PUAN SIRALAMA"},{"$f":"BN3","v":"3. PUAN SIRALAMA"}]
["Değerlendirme;",null,null,1,2,3,1,2,3,1,2,3,1,2,3,1,2,3,1,2,3,1,2,3,1,2,3,1,2,3,1,2,3,1,2,3]
["S.N.","NO","ADI SOYADI","10P","10P","10P","10P","10P","10P","10P","10P","10P","10P","10P","10P","10P","10P","10P","10P","10P","10P","10P","10P","10P","10P","10P","10P","10P","10P","10P","10P","10P","10P","100P","100P","100P"]
[1,{"$f":"IFERROR(IF(VLOOKUP($A6,'E OKUL YAPIŞTIR'!$A$1:$M$40,COLUMN(B1),0)=0,\"\",VLOOKUP($A6,'E OKUL YAPIŞTIR'!$A$1:$M$40,COLUMN(B1),0)),\"\")","v":""},{"$f":"IFERROR(IF(VLOOKUP($A6,'E OKUL YAPIŞTIR'!$A$1:$M$40,COLUMN(C1),0)=0,\"\",VLOOKUP($A6,'E OKUL YAPIŞTIR'!$A$1:$M$40,COLUMN(C1),0)),\"\")","v":""},{"$f":"IFERROR(IF(AN6=0,\"\",VLOOKUP(AN6,'PUAN DAĞILIMI'!$A$1:$M$3000,'ÇIKTI (3 DEĞERLENDİRME)'!AY$1,0)),0)","v":""},{"$f":"IFERROR(IF(AO6=0,\"\",VLOOKUP(AO6,'PUAN DAĞILIMI'!$A$1:$M$3000,'ÇIKTI (3 DEĞERLENDİRME)'!AZ$1,0)),0)","v":""},{"$f":"IFERROR(IF(AP6=0,\"\",VLOOKUP(AP6,'PUAN DAĞILIMI'!$A$1:$M$3000,'ÇIKTI (3 DEĞERLENDİRME)'!BA$1,0)),0)","v":""},{"$f":"IFERROR(IF(AQ6=0,\"\",VLOOKUP(AQ6,'PUAN DAĞILIMI'!$A$1:$M$3000,'ÇIKTI (3 DEĞERLENDİRME)'!BB$1,0)),0)","v":""},{"$f":"IFERROR(IF(AR6=0,\"\",VLOOKUP(AR6,'PUAN DAĞILIMI'!$A$1:$M$3000,'ÇIKTI (3 DEĞERLENDİRME)'!BC$1,0)),0)","v":""},{"$f":"IFERROR(IF(AS6=0,\"\",VLOOKUP(AS6,'PUAN DAĞILIMI'!$A$1:$M$3000,'ÇIKTI (3 DEĞERLENDİRME)'!BD$1,0)),0)","v":""},{"$f":"IFERROR(IF(AT6=0,\"\",VLOOKUP(AT6,'PUAN DAĞILIMI'!$A$1:$M$3000,'ÇIKTI (3 DEĞERLENDİRME)'!BE$1,0)),0)","v":""},{"$f":"IFERROR(IF(AU6=0,\"\",VLOOKUP(AU6,'PUAN DAĞILIMI'!$A$1:$M$3000,'ÇIKTI (3 DEĞERLENDİRME)'!BF$1,0)),0)","v":""},{"$f":"IFERROR(IF(AV6=0,\"\",VLOOKUP(AV6,'PUAN DAĞILIMI'!$A$1:$M$3000,'ÇIKTI (3 DEĞERLENDİRME)'!BG$1,0)),0)","v":""},{"$f":"IFERROR(IF(AW6=0,\"\",VLOOKUP(AW6,'PUAN DAĞILIMI'!$A$1:$M$3000,'ÇIKTI (3 DEĞERLENDİRME)'!BH$1,0)),0)","v":""},{"$f":"IFERROR(IF(AX6=0,\"\",VLOOKUP(AX6,'PUAN DAĞILIMI'!$A$1:$M$3000,'ÇIKTI (3 DEĞERLENDİRME)'!BI$1,0)),0)","v":""},{"$f":"IFERROR(IF(AY6=0,\"\",VLOOKUP(AY6,'PUAN DAĞILIMI'!$A$1:$M$3000,'ÇIKTI (3 DEĞERLENDİRME)'!BJ$1,0)),0)","v":""},{"$f":"IFERROR(IF(AZ6=0,\"\",VLOOKUP(AZ6,'PUAN DAĞILIMI'!$A$1:$M$3000,'ÇIKTI (3 DEĞERLENDİRME)'!BK$1,0)),0)","v":""},{"$f":"IFERROR(IF(BA6=0,\"\",VLOOKUP(BA6,'PUAN DAĞILIMI'!$A$1:$M$3000,'ÇIKTI (3 DEĞERLENDİRME)'!BL$1,0)),0)","v":""},{"$f":"IFERROR(IF(BB6=0,\"\",VLOOKUP(BB6,'PUAN DAĞILIMI'!$A$1:$M$3000,'ÇIKTI (3 DEĞERLENDİRME)'!BM$1,0)),0)","v":""},{"$f":"IFERROR(IF(BC6=0,\"\",VLOOKUP(BC6,'PUAN DAĞILIMI'!$A$1:$M$3000,'ÇIKTI (3 DEĞERLENDİRME)'!BN$1,0)),0)","v":""},{"$f":"IFERROR(IF(BD6=0,\"\",VLOOKUP(BD6,'PUAN DAĞILIMI'!$A$1:$M$3000,'ÇIKTI (3 DEĞERLENDİRME)'!BO$1,0)),0)","v":""},{"$f":"IFERROR(IF(BE6=0,\"\",VLOOKUP(BE6,'PUAN DAĞILIMI'!$A$1:$M$3000,'ÇIKTI (3 DEĞERLENDİRME)'!BP$1,0)),0)","v":""},{"$f":"IFERROR(IF(BF6=0,\"\",VLOOKUP(BF6,'PUAN DAĞILIMI'!$A$1:$M$3000,'ÇIKTI (3 DEĞERLENDİRME)'!BQ$1,0)),0)","v":""},{"$f":"IFERROR(IF(BG6=0,\"\",VLOOKUP(BG6,'PUAN DAĞILIMI'!$A$1:$M$3000,'ÇIKTI (3 DEĞERLENDİRME)'!BR$1,0)),0)","v":""},{"$f":"IFERROR(IF(BH6=0,\"\",VLOOKUP(BH6,'PUAN DAĞILIMI'!$A$1:$M$3000,'ÇIKTI (3 DEĞERLENDİRME)'!BS$1,0)),0)","v":""},{"$f":"IFERROR(IF(BI6=0,\"\",VLOOKUP(BI6,'PUAN DAĞILIMI'!$A$1:$M$3000,'ÇIKTI (3 DEĞERLENDİRME)'!BT$1,0)),0)","v":""},{"$f":"IFERROR(IF(BJ6=0,\"\",VLOOKUP(BJ6,'PUAN DAĞILIMI'!$A$1:$M$3000,'ÇIKTI (3 DEĞERLENDİRME)'!BU$1,0)),0)","v":""},{"$f":"IFERROR(IF(BK6=0,\"\",VLOOKUP(BK6,'PUAN DAĞILIMI'!$A$1:$M$3000,'ÇIKTI (3 DEĞERLENDİRME)'!BV$1,0)),0)","v":""},{"$f":"IFERROR(IF(BL6=0,\"\",VLOOKUP(BL6,'PUAN DAĞILIMI'!$A$1:$M$3000,'ÇIKTI (3 DEĞERLENDİRME)'!BW$1,0)),0)","v":""},{"$f":"IFERROR(IF(BM6=0,\"\",VLOOKUP(BM6,'PUAN DAĞILIMI'!$A$1:$M$3000,'ÇIKTI (3 DEĞERLENDİRME)'!BX$1,0)),0)","v":""},{"$f":"IFERROR(IF(BN6=0,\"\",VLOOKUP(BN6,'PUAN DAĞILIMI'!$A$1:$M$3000,'ÇIKTI (3 DEĞERLENDİRME)'!BY$1,0)),0)","v":""},{"$f":"IFERROR(IF(BO6=0,\"\",VLOOKUP(BO6,'PUAN DAĞILIMI'!$A$1:$M$3000,'ÇIKTI (3 DEĞERLENDİRME)'!BZ$1,0)),0)","v":""},{"$f":"IFERROR(IF(BP6=0,\"\",VLOOKUP(BP6,'PUAN DAĞILIMI'!$A$1:$M$3000,'ÇIKTI (3 DEĞERLENDİRME)'!CA$1,0)),0)","v":""},{"$f":"IFERROR(IF(BQ6=0,\"\",VLOOKUP(BQ6,'PUAN DAĞILIMI'!$A$1:$M$3000,'ÇIKTI (3 DEĞERLENDİRME)'!CB$1,0)),0)","v":""},{"$f":"IFERROR(IF((D6+G6+J6+M6+P6+S6+V6+Y6+AB6+AE6)=0,0,D6+G6+J6+M6+P6+S6+V6+Y6+AB6+AE6),\"\")","v":""},{"$f":"IFERROR(IF((E6+H6+K6+N6+Q6+T6+W6+Z6+AC6+AF6)=0,0,E6+H6+K6+N6+Q6+T6+W6+Z6+AC6+AF6),\"\")","v":""},{"$f":"IFERROR(IF((F6+I6+L6+O6+R6+U6+X6+AA6+AD6+AG6)=0,0,F6+I6+L6+O6+R6+U6+X6+AA6+AD6+AG6),\"\")","v":""},{"$f":"VLOOKUP($A6,'E OKUL YAPIŞTIR'!$A$1:$M$40,8,0)","v":0},{"$f":"VLOOKUP($A6,'E OKUL YAPIŞTIR'!$A$1:$M$40,9,0)","v":0},{"$f":"VLOOKUP($A6,'E OKUL YAPIŞTIR'!$A$1:$M$40,10,0)","v":0},{"$f":"IF(AK6=0,0,CONCATENATE(AK6,\"_\",COUNTIF($AK$6:AK6,AK6)))","v":0},{"$f":"IF(AL6=0,0,CONCATENATE(AL6,\"_\",COUNTIF($AK$6:AL6,AL6)))","v":0},{"$f":"IF(AM6=0,0,CONCATENATE(AM6,\"_\",COUNTIF($AK$6:AM6,AM6)))","v":0},{"$f":"AN6","v":0},{"$f":"AO6","v":0},{"$f":"AP6","v":0},{"$f":"AQ6","v":0},0,0,0,0,0,{"$f":"AW6","v":0},{"$f":"AX6","v":0},{"$f":"AY6","v":0},{"$f":"AZ6","v":0},{"$f":"BA6","v":0},{"$f":"BB6","v":0},{"$f":"BC6","v":0},{"$f":"BD6","v":0},{"$f":"BE6","v":0},{"$f":"BF6","v":0},{"$f":"BG6","v":0},{"$f":"BH6","v":0},{"$f":"BI6","v":0},{"$f":"BJ6","v":0},{"$f":"BK6","v":0},{"$f":"BL6","v":0},{"$f":"BM6","v":0},{"$f":"BN6","v":0}]
{"$rows_left_out":35}
{"sheet":"PUAN DAĞILIMI","index":2,"n_rows":1261,"n_cols":13,"rows_kept":1261,"cut":false,"hidden":true,"merged":[]}
[]
[{"$f":"CONCATENATE(C2,\"_\",B2)","v":"100_1"},1,{"$f":"SUM(D2:M2)","v":100},10,10,10,10,10,10,10,10,10,10]
[{"$f":"CONCATENATE(C3,\"_\",B3)","v":"100_2"},2,{"$f":"SUM(D3:M3)","v":100},{"$f":"M2","v":10},{"$f":"D2","v":10},{"$f":"E2","v":10},10,10,10,10,10,10,{"$f":"L2","v":10}]
["100_3",3,100,{"$f":"M3","v":10},{"$f":"D3","v":10},10,10,10,10,10,10,10,{"$f":"L3","v":10}]
["100_4",4,100,{"$f":"M4","v":10},{"$f":"D4","v":10},10,10,10,10,10,10,10,10]
["100_5",5,100,10,10,10,10,10,10,10,10,10,10]
{"$rows_left_out":1256}
{"sheet":"ÇIKTI (2 DEĞERLENDİRME)","index":3,"n_rows":40,"n_cols":61,"rows_kept":40,"cut":false,"hidden":false,"merged":[[3,0,3,2],[38,3,38,9],[38,14,38,16],[38,18,38,20],[39,3,39,9],[39,14,39,16],[39,18,39,20],[0,0,0,24],[1,0,1,24],[2,0,2,2],[2,3,2,4],[2,5,2,6],[2,7,2,8],[2,9,2,10],[2,11,2,12],[2,13,2,14],[2,15,2,16],[2,21,2,22],[2,23,2,24],[2,17,2,18],[2,19,2,20]]}
[{"$f":"CONCATENATE(SABİTLER!B2,\" \",SABİTLER!B8,\" EĞİTİM ÖĞRETİM YILI \")","v":"MUSTAFAKEMALPAŞA ORTAOKULU 2018-2019 EĞİTİM ÖĞRETİM YILI "},null,null,null,null,null,null,null,null,null,null,null,null,null,null,null,null,null,null,null,null,null,null,null,null,null,null,null,null,null,null,null,null,null,null,null,null,null,null,4,{"$f":"AN1","v":4},{"$f":"AO1+1","v":5},{"$f":"AP1","v":5},{"$f":"AQ1+1","v":6},{"$f":"AR1","v":6},{"$f":"AS1+1","v":7},{"$f":"AT1","v":7},{"$f":"AU1+1","v":8},{"$f":"AV1","v":8},{"$f":"AW1+1","v":9},{"$f":"AX1","v":9},{"$f":"AY1+1","v":10},{"$f":"AZ1","v":10},{"$f":"BA1+1","v":11},{"$f":"BB1","v":11},{"$f":"BC1+1","v":12},{"$f":"BD1","v":12},{"$f":"BE1+1","v":13},{"$f":"BF1","v":13},{"$f":"BG1+1","v":14},{"$f":"BH1","v":14}]
[{"$f":"CONCATENATE('E OKUL YAPIŞTIR'!R1,\" SINIFI \",SABİTLER!B3,\" DERSİ \",SABİTLER!B9,\" DERS İÇİ PERFORMANS DEĞERLENDİRME FORMU\")","v":"5/A SINIFI FEN BİLİMLERİ DERSİ 2. DÖNEM DERS İÇİ PERFORMANS DEĞERLENDİRME FORMU"}]
["Öğrenci Bilgileri;",null,null,{"$f":"VLOOKUP(1,SABİTLER!$E$2:$F$331,2,0)","v":"Grup çalışmalarına katılımı"},null,{"$f":"VLOOKUP(2,SABİTLER!$E$2:$F$331,2,0)","v":"Sınıf içi tartışmalara katılımı"},null,{"$f":"VLOOKUP(3,SABİTLER!$E$2:$F$331,2,0)","v":"Soru ve önerilere verdiği cevap"},null,{"$f":"VLOOKUP(4,SABİTLER!$E$2:$F$331,2,0)","v":"Sınıf etkinliklerine katılımı"},null,{"$f":"VLOOKUP(5,SABİTLER!$E$2:$F$331,2,0)","v":"Derse istekli olma"},null,{"$f":"VLOOKUP(6,SABİTLER!$E$2:$F$331,2,0)","v":"Verilen ödevleri zamanında yapma"},null,{"$f":"VLOOKUP(7,SABİTLER!$E$2:$F$331,2,0)","v":"Sınıf içi çalışmalarında dönüt alınabilmesi"},null,{"$f":"VLOOKUP(8,SABİTLER!$E$2:$F$331,2,0)","v":"Derslere hazır gelmesi"},null,{"$f":"VLOOKUP(9,SABİTLER!$E$2:$F$331,2,0)","v":"Derste yapılan deneylere etkili katılım"},null,{"$f":"VLOOKUP(10,SABİTLER!$E$2:$F$331,2,0)","v":"Sınıfın düzenini bozmaması"},null,{"$f":"VLOOKUP(11,SABİTLER!$E$2:$F$331,2,0)","v":"TOPLAM PUAN"},null,"1. PUANLAR","2. PUANLAR","1. PUAN SIRALAMA","2. PUAN SIRALAMA",{"$f":"AB3","v":"1. PUAN SIRALAMA"},"2. PUAN SIRALAMA","1. PUAN SIRALAMA","2. PUAN SIRALAMA","1. PUAN SIRALAMA","2. PUAN SIRALAMA","1. PUAN SIRALAMA","2. PUAN SIRALAMA","1. PUAN SIRALAMA","2. PUAN SIRALAMA","1. PUAN SIRALAMA","2. PUAN SIRALAMA","1. PUAN SIRALAMA","2. PUAN SIRALAMA","1. PUAN SIRALAMA","2. PUAN SIRALAMA","1. PUAN SIRALAMA","2. PUAN SIRALAMA"]
["Değerlendirme;",null,null,1,2,1,2,1,2,1,2,1,2,1,2,1,2,1,2,1,2,1,2,1,2]
["S.N.","NO","ADI SOYADI","10P","10P","10P","10P","10P","10P","10P","10P","10P","10P","10P","10P","10P","10P","10P","10P","10P","10P","10P","10P","100P","100P"]
[1,{"$f":"IFERROR(IF(VLOOKUP($A6,'E OKUL YAPIŞTIR'!$A$1:$M$40,COLUMN(B1),0)=0,\"\",VLOOKUP($A6,'E OKUL YAPIŞTIR'!$A$1:$M$40,COLUMN(B1),0)),\"\")","v":""},{"$f":"IFERROR(IF(VLOOKUP($A6,'E OKUL YAPIŞTIR'!$A$1:$M$40,COLUMN(C1),0)=0,\"\",VLOOKUP($A6,'E OKUL YAPIŞTIR'!$A$1:$M$40,COLUMN(C1),0)),\"\")","v":""},{"$f":"IFERROR(IF(AB6=0,\"\",VLOOKUP(AB6,'PUAN DAĞILIMI'!$A$1:$M$3000,'ÇIKTI (2 DEĞERLENDİRME)'!AN$1,0)),0)","v":""},{"$f":"IFERROR(IF(AC6=0,\"\",VLOOKUP(AC6,'PUAN DAĞILIMI'!$A$1:$M$3000,'ÇIKTI (2 DEĞERLENDİRME)'!AO$1,0)),0)","v":""},{"$f":"IFERROR(IF(AD6=0,\"\",VLOOKUP(AD6,'PUAN DAĞILIMI'!$A$1:$M$3000,'ÇIKTI (2 DEĞERLENDİRME)'!AP$1,0)),0)","v":""},{"$f":"IFERROR(IF(AE6=0,\"\",VLOOKUP(AE6,'PUAN DAĞILIMI'!$A$1:$M$3000,'ÇIKTI (2 DEĞERLENDİRME)'!AQ$1,0)),0)","v":""},{"$f":"IFERROR(IF(AF6=0,\"\",VLOOKUP(AF6,'PUAN DAĞILIMI'!$A$1:$M$3000,'ÇIKTI (2 DEĞERLENDİRME)'!AR$1,0)),0)","v":""},{"$f":"IFERROR(IF(AG6=0,\"\",VLOOKUP(AG6,'PUAN DAĞILIMI'!$A$1:$M$3000,'ÇIKTI (2 DEĞERLENDİRME)'!AS$1,0)),0)","v":""},{"$f":"IFERROR(IF(AH6=0,\"\",VLOOKUP(AH6,'PUAN DAĞILIMI'!$A$1:$M$3000,'ÇIKTI (2 DEĞERLENDİRME)'!AT$1,0)),0)","v":""},{"$f":"IFERROR(IF(AI6=0,\"\",VLOOKUP(AI6,'PUAN DAĞILIMI'!$A$1:$M$3000,'ÇIKTI (2 DEĞERLENDİRME)'!AU$1,0)),0)","v":""},{"$f":"IFERROR(IF(AJ6=0,\"\",VLOOKUP(AJ6,'PUAN DAĞILIMI'!$A$1:$M$3000,'ÇIKTI (2 DEĞERLENDİRME)'!AV$1,0)),0)","v":""},{"$f":"IFERROR(IF(AK6=0,\"\",VLOOKUP(AK6,'PUAN DAĞILIMI'!$A$1:$M$3000,'ÇIKTI (2 DEĞERLENDİRME)'!AW$1,0)),0)","v":""},{"$f":"IFERROR(IF(AL6=0,\"\",VLOOKUP(AL6,'PUAN DAĞILIMI'!$A$1:$M$3000,'ÇIKTI (2 DEĞERLENDİRME)'!AX$1,0)),0)","v":""},{"$f":"IFERROR(IF(AM6=0,\"\",VLOOKUP(AM6,'PUAN DAĞILIMI'!$A$1:$M$3000,'ÇIKTI (2 DEĞERLENDİRME)'!AY$1,0)),0)","v":""},{"$f":"IFERROR(IF(AN6=0,\"\",VLOOKUP(AN6,'PUAN DAĞILIMI'!$A$1:$M$3000,'ÇIKTI (2 DEĞERLENDİRME)'!AZ$1,0)),0)","v":""},{"$f":"IFERROR(IF(AO6=0,\"\",VLOOKUP(AO6,'PUAN DAĞILIMI'!$A$1:$M$3000,'ÇIKTI (2 DEĞERLENDİRME)'!BA$1,0)),0)","v":""},{"$f":"IFERROR(IF(AP6=0,\"\",VLOOKUP(AP6,'PUAN DAĞILIMI'!$A$1:$M$3000,'ÇIKTI (2 DEĞERLENDİRME)'!BB$1,0)),0)","v":""},{"$f":"IFERROR(IF(AQ6=0,\"\",VLOOKUP(AQ6,'PUAN DAĞILIMI'!$A$1:$M$3000,'ÇIKTI (2 DEĞERLENDİRME)'!BC$1,0)),0)","v":""},{"$f":"IFERROR(IF(AR6=0,\"\",VLOOKUP(AR6,'PUAN DAĞILIMI'!$A$1:$M$3000,'ÇIKTI (2 DEĞERLENDİRME)'!BD$1,0)),0)","v":""},{"$f":"IFERROR(IF(AS6=0,\"\",VLOOKUP(AS6,'PUAN DAĞILIMI'!$A$1:$M$3000,'ÇIKTI (2 DEĞERLENDİRME)'!BE$1,0)),0)","v":""},{"$f":"IFERROR(IF(AT6=0,\"\",VLOOKUP(AT6,'PUAN DAĞILIMI'!$A$1:$M$3000,'ÇIKTI (2 DEĞERLENDİRME)'!BF$1,0)),0)","v":""},{"$f":"IFERROR(IF(AU6=0,\"\",VLOOKUP(AU6,'PUAN DAĞILIMI'!$A$1:$M$3000,'ÇIKTI (2 DEĞERLENDİRME)'!BG$1,0)),0)","v":""},{"$f":"IFERROR(IF((D6+F6+H6+J6+L6+N6+P6+R6+T6+V6)=0,\"\",D6+F6+H6+J6+L6+N6+P6+R6+T6+V6),\"\")","v":""},{"$f":"IFERROR(IF((E6+G6+I6+K6+M6+O6+Q6+S6+U6+W6)=0,\"\",E6+G6+I6+K6+M6+O6+Q6+S6+U6+W6),\"\")","v":""},{"$f":"VLOOKUP($A6,'E OKUL YAPIŞTIR'!$A$1:$M$40,8,0)","v":0},{"$f":"VLOOKUP($A6,'E OKUL YAPIŞTIR'!$A$1:$M$40,9,0)","v":0},{"$f":"IF(Z6=0,0,CONCATENATE(Z6,\"_\",COUNTIF($Z$6:Z6,Z6)))","v":0},{"$f":"IF(AA6=0,0,CONCATENATE(AA6,\"_\",COUNTIF($Z$6:AA6,AA6)))","v":0},{"$f":"AB6","v":0},{"$f":"AC6","v":0},{"$f":"AD6","v":0},{"$f":"AE6","v":0},{"$f":"AF6","v":0},{"$f":"AG6","v":0},{"$f":"AH6","v":0},{"$f":"AI6","v":0},{"$f":"AJ6","v":0},{"$f":"AK6","v":0},{"$f":"AL6","v":0},{"$f":"AM6","v":0},{"$f":"AN6","v":0},{"$f":"AO6","v":0},{"$f":"AP6","v":0},{"$f":"AQ6","v":0},{"$f":"AR6","v":0},{"$f":"AS6","v":0}]
{"$rows_left_out":35}
{"sheet":"ÇIKTI (PROJE)","index":4,"n_rows":40,"n_cols":26,"rows_kept":40,"cut":false,"hidden":false,"merged":[[0,0,0,13],[2,0,2,13],[3,0,3,2],[38,9,38,12],[39,9,39,12],[1,0,1,13]]}
[{"$f":"CONCATENATE(SABİTLER!B2,\" \",SABİTLER!B8,\" EĞİTİM ÖĞRETİM YILI \")","v":"MUSTAFAKEMALPAŞA ORTAOKULU 2018-2019 EĞİTİM ÖĞRETİM YILI "},null,null,null,null,null,null,null,null,null,null,null,null,null,null,null,4,5,6,7,8,9,10,11,12,13]
[{"$f":"CONCATENATE('E OKUL YAPIŞTIR'!R1,\" SINIFI \",SABİTLER!B3,\" DERSİ \")","v":"5/A SINIFI FEN BİLİMLERİ DERSİ "}]
[{"$f":"CONCATENATE(SABİTLER!B9,\" PROJE DEĞERLENDİRME FORMU\")","v":"2. DÖNEM PROJE DEĞERLENDİRME FORMU"}]
["Öğrenci Bilgileri;",null,null,{"$f":"VLOOKUP(COLUMN(A1),SABİTLER!$O$3:$P$130,2,0)","v":"Araştırma ve bilgileri doğru kullanma"},{"$f":"VLOOKUP(COLUMN(B1),SABİTLER!$O$3:$P$130,2,0)","v":"Görsel materyal kullanımı"},{"$f":"VLOOKUP(COLUMN(C1),SABİTLER!$O$3:$P$130,2,0)","v":"Tertip, düzen ve estetik kullanımı"},{"$f":"VLOOKUP(COLUMN(D1),SABİTLER!$O$3:$P$130,2,0)","v":"Farklı kaynaklardan yararlanma"},{"$f":"VLOOKUP(COLUMN(E1),SABİTLER!$O$3:$P$130,2,0)","v":"Ödevi hazırlarken gerekli özen gösterilmesi"},{"$f":"VLOOKUP(COLUMN(F1),SABİTLER!$O$3:$P$130,2,0)","v":"Yazım ve imlaya dikkat etme"},{"$f":"VLOOKUP(COLUMN(G1),SABİTLER!$O$3:$P$130,2,0)","v":"Konunun bütünlüğü koruma"},{"$f":"VLOOKUP(COLUMN(H1),SABİTLER!$O$3:$P$130,2,0)","v":"Kendi başına hazırlama"},{"$f":"VLOOKUP(COLUMN(I1),SABİTLER!$O$3:$P$130,2,0)","v":"Öğretmenle iletişim"},{"$f":"VLOOKUP(COLUMN(J1),SABİTLER!$O$3:$P$130,2,0)","v":"Ödevin zamanında teslimi"},{"$f":"VLOOKUP(COLUMN(K1),SABİTLER!$O$3:$P$130,2,0)","v":"TOPLAM PUAN"},"1. PUANLAR","1. PUAN SIRALAMA"]
["S.N.","NO","ADI SOYADI","10P","10P","10P","10P","10P","10P","10P","10P","10P","10P","100P"]
[1,{"$f":"IFERROR(IF(VLOOKUP($A6,'E OKUL YAPIŞTIR'!$W$3:$Z$35,COLUMN(B1),0)=0,\"\",VLOOKUP($A6,'E OKUL YAPIŞTIR'!$W$3:$Z$35,COLUMN(B1),0)),\"\")","v":""},{"$f":"IFERROR(IF(VLOOKUP($A6,'E OKUL YAPIŞTIR'!$W$3:$Z$35,COLUMN(C1),0)=0,\"\",VLOOKUP($A6,'E OKUL YAPIŞTIR'!$W$3:$Z$35,COLUMN(C1),0)),\"\")","v":""},{"$f":"IFERROR(IF($P6=0,\"\",VLOOKUP($P6,'PUAN DAĞILIMI'!$A$1:$M$3000,Q$1,0)),\"\")","v":""},{"$f":"IFERROR(IF($P6=0,\"\",VLOOKUP($P6,'PUAN DAĞILIMI'!$A$1:$M$3000,R$1,0)),\"\")","v":""},{"$f":"IFERROR(IF($P6=0,\"\",VLOOKUP($P6,'PUAN DAĞILIMI'!$A$1:$M$3000,S$1,0)),\"\")","v":""},{"$f":"IFERROR(IF($P6=0,\"\",VLOOKUP($P6,'PUAN DAĞILIMI'!$A$1:$M$3000,T$1,0)),\"\")","v":""},{"$f":"IFERROR(IF($P6=0,\"\",VLOOKUP($P6,'PUAN DAĞILIMI'!$A$1:$M$3000,U$1,0)),\"\")","v":""},{"$f":"IFERROR(IF($P6=0,\"\",VLOOKUP($P6,'PUAN DAĞILIMI'!$A$1:$M$3000,V$1,0)),\"\")","v":""},{"$f":"IFERROR(IF($P6=0,\"\",VLOOKUP($P6,'PUAN DAĞILIMI'!$A$1:$M$3000,W$1,0)),\"\")","v":""},{"$f":"IFERROR(IF($P6=0,\"\",VLOOKUP($P6,'PUAN DAĞILIMI'!$A$1:$M$3000,X$1,0)),\"\")","v":""},{"$f":"IFERROR(IF($P6=0,\"\",VLOOKUP($P6,'PUAN DAĞILIMI'!$A$1:$M$3000,Y$1,0)),\"\")","v":""},{"$f":"IFERROR(IF($P6=0,\"\",VLOOKUP($P6,'PUAN DAĞILIMI'!$A$1:$M$3000,Z$1,0)),\"\")","v":""},{"$f":"IF(SUM(D6:M6)=0,\"\",SUM(D6:M6))","v":""},{"$f":"VLOOKUP($A6,'E OKUL YAPIŞTIR'!$W$3:$Z$35,4,0)","v":""},{"$f":"IF(O6=0,0,CONCATENATE(O6,\"_\",COUNTIF($O$6:O6,O6)))","v":"_1"}]
{"$rows_left_out":35}
{"sheet":"SABİTLER","index":5,"n_rows":13,"n_cols":16,"rows_kept":13,"cut":false,"hidden":false,"merged":[[0,14,0,15],[0,4,0,5]]}
[null,null,null,null,"DERS İÇİ PERFORMANS KRİTERLERİ",null,null,null,null,null,null,null,null,null,"PROJE ÖLÇEK KRİTERLERİ"]
["OKUL ADI:","MUSTAFAKEMALPAŞA ORTAOKULU",null,null,null,"DEĞERLENDİRME KRİTERLERİ",null,null,null,"2018-2019","1. DÖNEM"]
["DERSİN ADI:","FEN BİLİMLERİ",null,null,1,"Grup çalışmalarına katılımı",null,null,null,"2019-2020","2. DÖNEM",null,null,null,1,"Araştırma ve bilgileri doğru kullanma"]
["ÖĞRETMENİN ADI:","HÜSEYİN UĞUR",null,null,2,"Sınıf içi tartışmalara katılımı",null,null,null,"2020-2021",null,null,null,null,2,"Görsel materyal kullanımı"]
[null,"DERSİN ÖĞRETMENİ",null,null,3,"Soru ve önerilere verdiği cevap",null,null,null,"2021-2022",null,null,null,null,3,"Tertip, düzen ve estetik kullanımı"]
["İDARECİ ADI:","HAKAN YASTIKÇIOĞLU",null,null,4,"Sınıf etkinliklerine katılımı",null,null,null,"2022-2023",null,null,null,null,4,"Farklı kaynaklardan yararlanma"]
{"$rows_left_out":7}